GroupId: org.squashtest
ArtifactId: mon.squash.ta.project
Version: 1.0-SNAPSHOT
Execution date: 08/02/2018 22:50:26
ArtifactId: mon.squash.ta.project
Version: 1.0-SNAPSHOT
Execution date: 08/02/2018 22:50:26
| Test Set | Tests | Successes |
Failures |
Errors |
Not run |
Not found |
Success Rate | Time (s) | |
|---|---|---|---|---|---|---|---|---|---|
| tests | 2 | 0 | 0 | 2 | 0 | 0 | 0% | 5,428 | |
| Total: | 2 | 0 | 0 | 2 | 0 | 0 | 0% | 5,428 | |
Note:
- "Failures" are anticipated and checked for with assertions whereas "errors" are unanticipated.
- "Not run" means that the test case was not run, because an error / failure occurred during the ecosystem setup phase.
- The ecosystem might end up with an "error" or "failure" status, even if all its test cases were successful. It means an error / failure occurred during the ecosystem teardown phase.
| Script | Status | Time (s) | |
|---|---|---|---|
|
MACIFFR_Suite_Auto.ta | Error | 4,005 |
|
MACIFFR_Suite_Habitation.ta | Error | 1,404 |
Status: Error
Time (s): 4,005
Time (s): 4,005
| Test steps | Line | |
|---|---|---|
| TEST : | ||
|
LOAD selenium_resources AS __temp_0.file
CONVERT __temp_0.file TO script.java(compile) AS __temp_1.compiled
Test Automation Engine error (non SUT) : method 'convert' from engine component of class 'org.squashtest.ta.plugin.commons.converter.FileToJavaCodeBundle' with argument 'org.squashtest.ta.framework.components.FileResource' has thrown an exception.
Details: Java code compilation failed:
C:\Users\LEILA-~1\AppData\Local\Temp\Squash_TA\20180802_225010_769\tests\tests\MACIFFR_Suite_Auto.ta\selenium_resources8012856968087571944temp\java\utils\AbstractTest.java:12: error: package org.apache.logging.log4j does not exist
import org.apache.logging.log4j.LogManager;
^
C:\Users\LEILA-~1\AppData\Local\Temp\Squash_TA\20180802_225010_769\tests\tests\MACIFFR_Suite_Auto.ta\selenium_resources8012856968087571944temp\java\utils\AbstractTest.java:13: error: package org.apache.logging.log4j does not exist
import org.apache.logging.log4j.Logger;
^
C:\Users\LEILA-~1\AppData\Local\Temp\Squash_TA\20180802_225010_769\tests\tests\MACIFFR_Suite_Auto.ta\selenium_resources8012856968087571944temp\java\utils\AbstractTest.java:31: error: cannot find symbol
private static final Logger logger = LogManager.getLogger("AbstractTest");
^
symbol: class Logger
location: class AbstractTest
C:\Users\LEILA-~1\AppData\Local\Temp\Squash_TA\20180802_225010_769\tests\tests\MACIFFR_Suite_Auto.ta\selenium_resources8012856968087571944temp\java\pageObjects\Page_Abstract.java:8: error: package org.apache.logging.log4j does not exist
import org.apache.logging.log4j.*;
^
C:\Users\LEILA-~1\AppData\Local\Temp\Squash_TA\20180802_225010_769\tests\tests\MACIFFR_Suite_Auto.ta\selenium_resources8012856968087571944temp\java\pageObjects\Page_Abstract.java:27: error: cannot find symbol
private static final Logger logger = LogManager.getLogger("Page_Abstract");
^
symbol: class Logger
location: class Page_Abstract
C:\Users\LEILA-~1\AppData\Local\Temp\Squash_TA\20180802_225010_769\tests\tests\MACIFFR_Suite_Auto.ta\selenium_resources8012856968087571944temp\java\pageObjects\Page_Home.java:5: error: package org.apache.logging.log4j does not exist
import org.apache.logging.log4j.LogManager;
^
C:\Users\LEILA-~1\AppData\Local\Temp\Squash_TA\20180802_225010_769\tests\tests\MACIFFR_Suite_Auto.ta\selenium_resources8012856968087571944temp\java\pageObjects\Page_Home.java:6: error: package org.apache.logging.log4j does not exist
import org.apache.logging.log4j.Logger;
^
C:\Users\LEILA-~1\AppData\Local\Temp\Squash_TA\20180802_225010_769\tests\tests\MACIFFR_Suite_Auto.ta\selenium_resources8012856968087571944temp\java\pageObjects\Page_Home.java:23: error: cannot find symbol
private static final Logger logger = LogManager.getLogger("Page_Home");
^
symbol: class Logger
location: class Page_Home
8 errors
org.squashtest.ta.backbone.exception.EngineRuntimeException: Test Automation Engine error (non SUT) : method 'convert' from engine component of class 'org.squashtest.ta.plugin.commons.converter.FileToJavaCodeBundle' with argument 'org.squashtest.ta.framework.components.FileResource' has thrown an exception.
Details: Java code compilation failed:
C:\Users\LEILA-~1\AppData\Local\Temp\Squash_TA\20180802_225010_769\tests\tests\MACIFFR_Suite_Auto.ta\selenium_resources8012856968087571944temp\java\utils\AbstractTest.java:12: error: package org.apache.logging.log4j does not exist
import org.apache.logging.log4j.LogManager;
^
C:\Users\LEILA-~1\AppData\Local\Temp\Squash_TA\20180802_225010_769\tests\tests\MACIFFR_Suite_Auto.ta\selenium_resources8012856968087571944temp\java\utils\AbstractTest.java:13: error: package org.apache.logging.log4j does not exist
import org.apache.logging.log4j.Logger;
^
C:\Users\LEILA-~1\AppData\Local\Temp\Squash_TA\20180802_225010_769\tests\tests\MACIFFR_Suite_Auto.ta\selenium_resources8012856968087571944temp\java\utils\AbstractTest.java:31: error: cannot find symbol
private static final Logger logger = LogManager.getLogger("AbstractTest");
^
symbol: class Logger
location: class AbstractTest
C:\Users\LEILA-~1\AppData\Local\Temp\Squash_TA\20180802_225010_769\tests\tests\MACIFFR_Suite_Auto.ta\selenium_resources8012856968087571944temp\java\pageObjects\Page_Abstract.java:8: error: package org.apache.logging.log4j does not exist
import org.apache.logging.log4j.*;
^
C:\Users\LEILA-~1\AppData\Local\Temp\Squash_TA\20180802_225010_769\tests\tests\MACIFFR_Suite_Auto.ta\selenium_resources8012856968087571944temp\java\pageObjects\Page_Abstract.java:27: error: cannot find symbol
private static final Logger logger = LogManager.getLogger("Page_Abstract");
^
symbol: class Logger
location: class Page_Abstract
C:\Users\LEILA-~1\AppData\Local\Temp\Squash_TA\20180802_225010_769\tests\tests\MACIFFR_Suite_Auto.ta\selenium_resources8012856968087571944temp\java\pageObjects\Page_Home.java:5: error: package org.apache.logging.log4j does not exist
import org.apache.logging.log4j.LogManager;
^
C:\Users\LEILA-~1\AppData\Local\Temp\Squash_TA\20180802_225010_769\tests\tests\MACIFFR_Suite_Auto.ta\selenium_resources8012856968087571944temp\java\pageObjects\Page_Home.java:6: error: package org.apache.logging.log4j does not exist
import org.apache.logging.log4j.Logger;
^
C:\Users\LEILA-~1\AppData\Local\Temp\Squash_TA\20180802_225010_769\tests\tests\MACIFFR_Suite_Auto.ta\selenium_resources8012856968087571944temp\java\pageObjects\Page_Home.java:23: error: cannot find symbol
private static final Logger logger = LogManager.getLogger("Page_Home");
^
symbol: class Logger
location: class Page_Home
8 errors
at org.squashtest.ta.backbone.tools.ReflectionUtils.invoke(ReflectionUtils.java:277)
at org.squashtest.ta.backbone.engine.wrapper.ResourceConverterHandler.convert(ResourceConverterHandler.java:106)
at org.squashtest.ta.backbone.engine.instructionrunner.DefaultConvertResourceRunner.applyConverter(DefaultConvertResourceRunner.java:130)
at org.squashtest.ta.backbone.engine.instructionrunner.DefaultConvertResourceRunner.convertResource(DefaultConvertResourceRunner.java:94)
at org.squashtest.ta.backbone.engine.instructionrunner.DefaultConvertResourceRunner.doRun(DefaultConvertResourceRunner.java:54)
at org.squashtest.ta.backbone.engine.instructionrunner.AbstractDefaultInstructionRunner.run(AbstractDefaultInstructionRunner.java:69)
at org.squashtest.ta.backbone.engine.impl.TestRunnerImpl.runInstruction(TestRunnerImpl.java:205)
at org.squashtest.ta.backbone.engine.impl.TestRunnerImpl.runInstructionList(TestRunnerImpl.java:150)
at org.squashtest.ta.backbone.engine.impl.TestRunnerImpl.runMetaInstruction(TestRunnerImpl.java:174)
at org.squashtest.ta.backbone.engine.impl.TestRunnerImpl.runInstructionList(TestRunnerImpl.java:148)
at org.squashtest.ta.backbone.engine.impl.TestRunnerImpl.runPhase(TestRunnerImpl.java:138)
at org.squashtest.ta.backbone.engine.impl.TestRunnerImpl.runTest(TestRunnerImpl.java:109)
at org.squashtest.ta.backbone.engine.impl.EcosystemRunnerImpl.runAllTests(EcosystemRunnerImpl.java:202)
at org.squashtest.ta.backbone.engine.impl.EcosystemRunnerImpl.run(EcosystemRunnerImpl.java:104)
at org.squashtest.ta.backbone.engine.impl.SuiteRunnerImpl.execute(SuiteRunnerImpl.java:68)
at org.squashtest.ta.backbone.engine.impl.EngineImpl.execute(EngineImpl.java:63)
at org.squashtest.ta.maven.SquashTAMojo.executeImpl(SquashTAMojo.java:309)
at org.squashtest.ta.maven.AbstractSquashTaMojo.execution(AbstractSquashTaMojo.java:98)
at org.squashtest.ta.maven.AbstractBaseSquashTaMojo.execute(AbstractBaseSquashTaMojo.java:150)
at org.apache.maven.plugin.DefaultBuildPluginManager.executeMojo(DefaultBuildPluginManager.java:137)
at org.apache.maven.lifecycle.internal.MojoExecutor.execute(MojoExecutor.java:208)
at org.apache.maven.lifecycle.internal.MojoExecutor.execute(MojoExecutor.java:154)
at org.apache.maven.lifecycle.internal.MojoExecutor.execute(MojoExecutor.java:146)
at org.apache.maven.lifecycle.internal.LifecycleModuleBuilder.buildProject(LifecycleModuleBuilder.java:117)
at org.apache.maven.lifecycle.internal.LifecycleModuleBuilder.buildProject(LifecycleModuleBuilder.java:81)
at org.apache.maven.lifecycle.internal.builder.singlethreaded.SingleThreadedBuilder.build(SingleThreadedBuilder.java:56)
at org.apache.maven.lifecycle.internal.LifecycleStarter.execute(LifecycleStarter.java:128)
at org.apache.maven.DefaultMaven.doExecute(DefaultMaven.java:305)
at org.apache.maven.DefaultMaven.doExecute(DefaultMaven.java:192)
at org.apache.maven.DefaultMaven.execute(DefaultMaven.java:105)
at org.apache.maven.cli.MavenCli.execute(MavenCli.java:954)
at org.apache.maven.cli.MavenCli.doMain(MavenCli.java:288)
at org.apache.maven.cli.MavenCli.main(MavenCli.java:192)
at sun.reflect.NativeMethodAccessorImpl.invoke0(Native Method)
at sun.reflect.NativeMethodAccessorImpl.invoke(NativeMethodAccessorImpl.java:62)
at sun.reflect.DelegatingMethodAccessorImpl.invoke(DelegatingMethodAccessorImpl.java:43)
at java.lang.reflect.Method.invoke(Method.java:498)
at org.codehaus.plexus.classworlds.launcher.Launcher.launchEnhanced(Launcher.java:289)
at org.codehaus.plexus.classworlds.launcher.Launcher.launch(Launcher.java:229)
at org.codehaus.plexus.classworlds.launcher.Launcher.mainWithExitCode(Launcher.java:415)
at org.codehaus.plexus.classworlds.launcher.Launcher.main(Launcher.java:356)
Caused by: org.squashtest.ta.framework.exception.BadDataException: Java code compilation failed:
C:\Users\LEILA-~1\AppData\Local\Temp\Squash_TA\20180802_225010_769\tests\tests\MACIFFR_Suite_Auto.ta\selenium_resources8012856968087571944temp\java\utils\AbstractTest.java:12: error: package org.apache.logging.log4j does not exist
import org.apache.logging.log4j.LogManager;
^
C:\Users\LEILA-~1\AppData\Local\Temp\Squash_TA\20180802_225010_769\tests\tests\MACIFFR_Suite_Auto.ta\selenium_resources8012856968087571944temp\java\utils\AbstractTest.java:13: error: package org.apache.logging.log4j does not exist
import org.apache.logging.log4j.Logger;
^
C:\Users\LEILA-~1\AppData\Local\Temp\Squash_TA\20180802_225010_769\tests\tests\MACIFFR_Suite_Auto.ta\selenium_resources8012856968087571944temp\java\utils\AbstractTest.java:31: error: cannot find symbol
private static final Logger logger = LogManager.getLogger("AbstractTest");
^
symbol: class Logger
location: class AbstractTest
C:\Users\LEILA-~1\AppData\Local\Temp\Squash_TA\20180802_225010_769\tests\tests\MACIFFR_Suite_Auto.ta\selenium_resources8012856968087571944temp\java\pageObjects\Page_Abstract.java:8: error: package org.apache.logging.log4j does not exist
import org.apache.logging.log4j.*;
^
C:\Users\LEILA-~1\AppData\Local\Temp\Squash_TA\20180802_225010_769\tests\tests\MACIFFR_Suite_Auto.ta\selenium_resources8012856968087571944temp\java\pageObjects\Page_Abstract.java:27: error: cannot find symbol
private static final Logger logger = LogManager.getLogger("Page_Abstract");
^
symbol: class Logger
location: class Page_Abstract
C:\Users\LEILA-~1\AppData\Local\Temp\Squash_TA\20180802_225010_769\tests\tests\MACIFFR_Suite_Auto.ta\selenium_resources8012856968087571944temp\java\pageObjects\Page_Home.java:5: error: package org.apache.logging.log4j does not exist
import org.apache.logging.log4j.LogManager;
^
C:\Users\LEILA-~1\AppData\Local\Temp\Squash_TA\20180802_225010_769\tests\tests\MACIFFR_Suite_Auto.ta\selenium_resources8012856968087571944temp\java\pageObjects\Page_Home.java:6: error: package org.apache.logging.log4j does not exist
import org.apache.logging.log4j.Logger;
^
C:\Users\LEILA-~1\AppData\Local\Temp\Squash_TA\20180802_225010_769\tests\tests\MACIFFR_Suite_Auto.ta\selenium_resources8012856968087571944temp\java\pageObjects\Page_Home.java:23: error: cannot find symbol
private static final Logger logger = LogManager.getLogger("Page_Home");
^
symbol: class Logger
location: class Page_Home
8 errors
at org.squashtest.ta.plugin.commons.converter.FileToJavaCodeBundle.convert(FileToJavaCodeBundle.java:113)
at sun.reflect.NativeMethodAccessorImpl.invoke0(Native Method)
at sun.reflect.NativeMethodAccessorImpl.invoke(NativeMethodAccessorImpl.java:62)
at sun.reflect.DelegatingMethodAccessorImpl.invoke(DelegatingMethodAccessorImpl.java:43)
at java.lang.reflect.Method.invoke(Method.java:498)
at org.squashtest.ta.backbone.tools.ReflectionUtils.invoke(ReflectionUtils.java:252)
... 40 more
CONVERT __temp_1.compiled TO script.java.selenium2(script) USING $(tests.Devis_Auto_Non_Connecte) AS __temp_2.selenium
EXECUTE execute WITH __temp_2.selenium AS __temp_3.result
ASSERT __temp_3.result IS success
|
2 |
Status: Error
Time (s): 1,404
Time (s): 1,404
| Test steps | Line | |
|---|---|---|
| TEST : | ||
|
LOAD selenium_resources AS __temp_4.file
CONVERT __temp_4.file TO script.java(compile) AS __temp_5.compiled
Test Automation Engine error (non SUT) : method 'convert' from engine component of class 'org.squashtest.ta.plugin.commons.converter.FileToJavaCodeBundle' with argument 'org.squashtest.ta.framework.components.FileResource' has thrown an exception.
Details: Java code compilation failed:
C:\Users\LEILA-~1\AppData\Local\Temp\Squash_TA\20180802_225010_769\tests\tests\MACIFFR_Suite_Habitation.ta\selenium_resources5716142459906097017temp\java\pageObjects\Page_Abstract.java:8: error: package org.apache.logging.log4j does not exist
import org.apache.logging.log4j.*;
^
C:\Users\LEILA-~1\AppData\Local\Temp\Squash_TA\20180802_225010_769\tests\tests\MACIFFR_Suite_Habitation.ta\selenium_resources5716142459906097017temp\java\utils\AbstractTest.java:12: error: package org.apache.logging.log4j does not exist
import org.apache.logging.log4j.LogManager;
^
C:\Users\LEILA-~1\AppData\Local\Temp\Squash_TA\20180802_225010_769\tests\tests\MACIFFR_Suite_Habitation.ta\selenium_resources5716142459906097017temp\java\utils\AbstractTest.java:13: error: package org.apache.logging.log4j does not exist
import org.apache.logging.log4j.Logger;
^
C:\Users\LEILA-~1\AppData\Local\Temp\Squash_TA\20180802_225010_769\tests\tests\MACIFFR_Suite_Habitation.ta\selenium_resources5716142459906097017temp\java\pageObjects\Page_Abstract.java:27: error: cannot find symbol
private static final Logger logger = LogManager.getLogger("Page_Abstract");
^
symbol: class Logger
location: class Page_Abstract
C:\Users\LEILA-~1\AppData\Local\Temp\Squash_TA\20180802_225010_769\tests\tests\MACIFFR_Suite_Habitation.ta\selenium_resources5716142459906097017temp\java\utils\AbstractTest.java:31: error: cannot find symbol
private static final Logger logger = LogManager.getLogger("AbstractTest");
^
symbol: class Logger
location: class AbstractTest
C:\Users\LEILA-~1\AppData\Local\Temp\Squash_TA\20180802_225010_769\tests\tests\MACIFFR_Suite_Habitation.ta\selenium_resources5716142459906097017temp\java\pageObjects\Page_Home.java:5: error: package org.apache.logging.log4j does not exist
import org.apache.logging.log4j.LogManager;
^
C:\Users\LEILA-~1\AppData\Local\Temp\Squash_TA\20180802_225010_769\tests\tests\MACIFFR_Suite_Habitation.ta\selenium_resources5716142459906097017temp\java\pageObjects\Page_Home.java:6: error: package org.apache.logging.log4j does not exist
import org.apache.logging.log4j.Logger;
^
C:\Users\LEILA-~1\AppData\Local\Temp\Squash_TA\20180802_225010_769\tests\tests\MACIFFR_Suite_Habitation.ta\selenium_resources5716142459906097017temp\java\pageObjects\Page_Home.java:23: error: cannot find symbol
private static final Logger logger = LogManager.getLogger("Page_Home");
^
symbol: class Logger
location: class Page_Home
8 errors
org.squashtest.ta.backbone.exception.EngineRuntimeException: Test Automation Engine error (non SUT) : method 'convert' from engine component of class 'org.squashtest.ta.plugin.commons.converter.FileToJavaCodeBundle' with argument 'org.squashtest.ta.framework.components.FileResource' has thrown an exception.
Details: Java code compilation failed:
C:\Users\LEILA-~1\AppData\Local\Temp\Squash_TA\20180802_225010_769\tests\tests\MACIFFR_Suite_Habitation.ta\selenium_resources5716142459906097017temp\java\pageObjects\Page_Abstract.java:8: error: package org.apache.logging.log4j does not exist
import org.apache.logging.log4j.*;
^
C:\Users\LEILA-~1\AppData\Local\Temp\Squash_TA\20180802_225010_769\tests\tests\MACIFFR_Suite_Habitation.ta\selenium_resources5716142459906097017temp\java\utils\AbstractTest.java:12: error: package org.apache.logging.log4j does not exist
import org.apache.logging.log4j.LogManager;
^
C:\Users\LEILA-~1\AppData\Local\Temp\Squash_TA\20180802_225010_769\tests\tests\MACIFFR_Suite_Habitation.ta\selenium_resources5716142459906097017temp\java\utils\AbstractTest.java:13: error: package org.apache.logging.log4j does not exist
import org.apache.logging.log4j.Logger;
^
C:\Users\LEILA-~1\AppData\Local\Temp\Squash_TA\20180802_225010_769\tests\tests\MACIFFR_Suite_Habitation.ta\selenium_resources5716142459906097017temp\java\pageObjects\Page_Abstract.java:27: error: cannot find symbol
private static final Logger logger = LogManager.getLogger("Page_Abstract");
^
symbol: class Logger
location: class Page_Abstract
C:\Users\LEILA-~1\AppData\Local\Temp\Squash_TA\20180802_225010_769\tests\tests\MACIFFR_Suite_Habitation.ta\selenium_resources5716142459906097017temp\java\utils\AbstractTest.java:31: error: cannot find symbol
private static final Logger logger = LogManager.getLogger("AbstractTest");
^
symbol: class Logger
location: class AbstractTest
C:\Users\LEILA-~1\AppData\Local\Temp\Squash_TA\20180802_225010_769\tests\tests\MACIFFR_Suite_Habitation.ta\selenium_resources5716142459906097017temp\java\pageObjects\Page_Home.java:5: error: package org.apache.logging.log4j does not exist
import org.apache.logging.log4j.LogManager;
^
C:\Users\LEILA-~1\AppData\Local\Temp\Squash_TA\20180802_225010_769\tests\tests\MACIFFR_Suite_Habitation.ta\selenium_resources5716142459906097017temp\java\pageObjects\Page_Home.java:6: error: package org.apache.logging.log4j does not exist
import org.apache.logging.log4j.Logger;
^
C:\Users\LEILA-~1\AppData\Local\Temp\Squash_TA\20180802_225010_769\tests\tests\MACIFFR_Suite_Habitation.ta\selenium_resources5716142459906097017temp\java\pageObjects\Page_Home.java:23: error: cannot find symbol
private static final Logger logger = LogManager.getLogger("Page_Home");
^
symbol: class Logger
location: class Page_Home
8 errors
at org.squashtest.ta.backbone.tools.ReflectionUtils.invoke(ReflectionUtils.java:277)
at org.squashtest.ta.backbone.engine.wrapper.ResourceConverterHandler.convert(ResourceConverterHandler.java:106)
at org.squashtest.ta.backbone.engine.instructionrunner.DefaultConvertResourceRunner.applyConverter(DefaultConvertResourceRunner.java:130)
at org.squashtest.ta.backbone.engine.instructionrunner.DefaultConvertResourceRunner.convertResource(DefaultConvertResourceRunner.java:94)
at org.squashtest.ta.backbone.engine.instructionrunner.DefaultConvertResourceRunner.doRun(DefaultConvertResourceRunner.java:54)
at org.squashtest.ta.backbone.engine.instructionrunner.AbstractDefaultInstructionRunner.run(AbstractDefaultInstructionRunner.java:69)
at org.squashtest.ta.backbone.engine.impl.TestRunnerImpl.runInstruction(TestRunnerImpl.java:205)
at org.squashtest.ta.backbone.engine.impl.TestRunnerImpl.runInstructionList(TestRunnerImpl.java:150)
at org.squashtest.ta.backbone.engine.impl.TestRunnerImpl.runMetaInstruction(TestRunnerImpl.java:174)
at org.squashtest.ta.backbone.engine.impl.TestRunnerImpl.runInstructionList(TestRunnerImpl.java:148)
at org.squashtest.ta.backbone.engine.impl.TestRunnerImpl.runPhase(TestRunnerImpl.java:138)
at org.squashtest.ta.backbone.engine.impl.TestRunnerImpl.runTest(TestRunnerImpl.java:109)
at org.squashtest.ta.backbone.engine.impl.EcosystemRunnerImpl.runAllTests(EcosystemRunnerImpl.java:202)
at org.squashtest.ta.backbone.engine.impl.EcosystemRunnerImpl.run(EcosystemRunnerImpl.java:104)
at org.squashtest.ta.backbone.engine.impl.SuiteRunnerImpl.execute(SuiteRunnerImpl.java:68)
at org.squashtest.ta.backbone.engine.impl.EngineImpl.execute(EngineImpl.java:63)
at org.squashtest.ta.maven.SquashTAMojo.executeImpl(SquashTAMojo.java:309)
at org.squashtest.ta.maven.AbstractSquashTaMojo.execution(AbstractSquashTaMojo.java:98)
at org.squashtest.ta.maven.AbstractBaseSquashTaMojo.execute(AbstractBaseSquashTaMojo.java:150)
at org.apache.maven.plugin.DefaultBuildPluginManager.executeMojo(DefaultBuildPluginManager.java:137)
at org.apache.maven.lifecycle.internal.MojoExecutor.execute(MojoExecutor.java:208)
at org.apache.maven.lifecycle.internal.MojoExecutor.execute(MojoExecutor.java:154)
at org.apache.maven.lifecycle.internal.MojoExecutor.execute(MojoExecutor.java:146)
at org.apache.maven.lifecycle.internal.LifecycleModuleBuilder.buildProject(LifecycleModuleBuilder.java:117)
at org.apache.maven.lifecycle.internal.LifecycleModuleBuilder.buildProject(LifecycleModuleBuilder.java:81)
at org.apache.maven.lifecycle.internal.builder.singlethreaded.SingleThreadedBuilder.build(SingleThreadedBuilder.java:56)
at org.apache.maven.lifecycle.internal.LifecycleStarter.execute(LifecycleStarter.java:128)
at org.apache.maven.DefaultMaven.doExecute(DefaultMaven.java:305)
at org.apache.maven.DefaultMaven.doExecute(DefaultMaven.java:192)
at org.apache.maven.DefaultMaven.execute(DefaultMaven.java:105)
at org.apache.maven.cli.MavenCli.execute(MavenCli.java:954)
at org.apache.maven.cli.MavenCli.doMain(MavenCli.java:288)
at org.apache.maven.cli.MavenCli.main(MavenCli.java:192)
at sun.reflect.NativeMethodAccessorImpl.invoke0(Native Method)
at sun.reflect.NativeMethodAccessorImpl.invoke(NativeMethodAccessorImpl.java:62)
at sun.reflect.DelegatingMethodAccessorImpl.invoke(DelegatingMethodAccessorImpl.java:43)
at java.lang.reflect.Method.invoke(Method.java:498)
at org.codehaus.plexus.classworlds.launcher.Launcher.launchEnhanced(Launcher.java:289)
at org.codehaus.plexus.classworlds.launcher.Launcher.launch(Launcher.java:229)
at org.codehaus.plexus.classworlds.launcher.Launcher.mainWithExitCode(Launcher.java:415)
at org.codehaus.plexus.classworlds.launcher.Launcher.main(Launcher.java:356)
Caused by: org.squashtest.ta.framework.exception.BadDataException: Java code compilation failed:
C:\Users\LEILA-~1\AppData\Local\Temp\Squash_TA\20180802_225010_769\tests\tests\MACIFFR_Suite_Habitation.ta\selenium_resources5716142459906097017temp\java\pageObjects\Page_Abstract.java:8: error: package org.apache.logging.log4j does not exist
import org.apache.logging.log4j.*;
^
C:\Users\LEILA-~1\AppData\Local\Temp\Squash_TA\20180802_225010_769\tests\tests\MACIFFR_Suite_Habitation.ta\selenium_resources5716142459906097017temp\java\utils\AbstractTest.java:12: error: package org.apache.logging.log4j does not exist
import org.apache.logging.log4j.LogManager;
^
C:\Users\LEILA-~1\AppData\Local\Temp\Squash_TA\20180802_225010_769\tests\tests\MACIFFR_Suite_Habitation.ta\selenium_resources5716142459906097017temp\java\utils\AbstractTest.java:13: error: package org.apache.logging.log4j does not exist
import org.apache.logging.log4j.Logger;
^
C:\Users\LEILA-~1\AppData\Local\Temp\Squash_TA\20180802_225010_769\tests\tests\MACIFFR_Suite_Habitation.ta\selenium_resources5716142459906097017temp\java\pageObjects\Page_Abstract.java:27: error: cannot find symbol
private static final Logger logger = LogManager.getLogger("Page_Abstract");
^
symbol: class Logger
location: class Page_Abstract
C:\Users\LEILA-~1\AppData\Local\Temp\Squash_TA\20180802_225010_769\tests\tests\MACIFFR_Suite_Habitation.ta\selenium_resources5716142459906097017temp\java\utils\AbstractTest.java:31: error: cannot find symbol
private static final Logger logger = LogManager.getLogger("AbstractTest");
^
symbol: class Logger
location: class AbstractTest
C:\Users\LEILA-~1\AppData\Local\Temp\Squash_TA\20180802_225010_769\tests\tests\MACIFFR_Suite_Habitation.ta\selenium_resources5716142459906097017temp\java\pageObjects\Page_Home.java:5: error: package org.apache.logging.log4j does not exist
import org.apache.logging.log4j.LogManager;
^
C:\Users\LEILA-~1\AppData\Local\Temp\Squash_TA\20180802_225010_769\tests\tests\MACIFFR_Suite_Habitation.ta\selenium_resources5716142459906097017temp\java\pageObjects\Page_Home.java:6: error: package org.apache.logging.log4j does not exist
import org.apache.logging.log4j.Logger;
^
C:\Users\LEILA-~1\AppData\Local\Temp\Squash_TA\20180802_225010_769\tests\tests\MACIFFR_Suite_Habitation.ta\selenium_resources5716142459906097017temp\java\pageObjects\Page_Home.java:23: error: cannot find symbol
private static final Logger logger = LogManager.getLogger("Page_Home");
^
symbol: class Logger
location: class Page_Home
8 errors
at org.squashtest.ta.plugin.commons.converter.FileToJavaCodeBundle.convert(FileToJavaCodeBundle.java:113)
at sun.reflect.NativeMethodAccessorImpl.invoke0(Native Method)
at sun.reflect.NativeMethodAccessorImpl.invoke(NativeMethodAccessorImpl.java:62)
at sun.reflect.DelegatingMethodAccessorImpl.invoke(DelegatingMethodAccessorImpl.java:43)
at java.lang.reflect.Method.invoke(Method.java:498)
at org.squashtest.ta.backbone.tools.ReflectionUtils.invoke(ReflectionUtils.java:252)
... 40 more
CONVERT __temp_5.compiled TO script.java.selenium2(script) USING $(tests.Devis_Habitation) AS __temp_6.selenium
EXECUTE execute WITH __temp_6.selenium AS __temp_7.result
ASSERT __temp_7.result IS success
|
2 |
Successes
Failures
Errors
Not run
